Reaction Details
Target15-hydroxyprostaglandin dehydrogenase [NAD(+)]
LigandBDBM347359
Substrate/Competitorn/a
Meas. Tech.In Vitro Assay
IC50 2.74±n/a nM
Citation Markowitz, SWillson, JKPosner, BReady, JAntczak, MZhang, YDesai, AGerson, SGreenlee, W Compositions and methods of modulating short-chain dehydrogenase activity US Patent US9789116 Publication Date 10/17/2017
 
15-hydroxyprostaglandin dehydrogenase [NAD(+)]
Name:15-hydroxyprostaglandin dehydrogenase [NAD(+)]
Type:Protein
Mol. Mass.:28938.62
Organism:Rattus norvegicus (Rat)
Description:O08699
Residue:266
BDBM347359
NameBDBM347359
Synonyms:US10301320, ID SW033291 US20230285402, ID # SW206976 | US9789116, SW033291
TypeSmall organic molecule
Emp. Form.C21H20N2OS3
Mol. Mass.412.591
SMILESCCCCS(=O)c1sc2nc(cc(-c3ccccc3)c2c1N)-c1cccs1