Reaction Details
Target15-hydroxyprostaglandin dehydrogenase [NAD(+)]
LigandBDBM347388
Substrate/Competitorn/a
Meas. Tech.In Vitro Assay
IC50 1.43±n/a nM
Citation Markowitz, SWillson, JKPosner, BReady, JAntczak, MZhang, YDesai, AGerson, SGreenlee, W Compositions and methods of modulating short-chain dehydrogenase activity US Patent US9789116 Publication Date 10/17/2017
 
15-hydroxyprostaglandin dehydrogenase [NAD(+)]
Name:15-hydroxyprostaglandin dehydrogenase [NAD(+)]
Type:Enzyme
Mol. Mass.:28974.46
Organism:Homo sapiens (Human)
Description:P15428
Residue:266
BDBM347388
NameBDBM347388
Synonyms:US10869871, ID # SW208488 US9789116, SW208488
TypeSmall organic molecule
Emp. Form.C16H18N2OS3
Mol. Mass.350.522
SMILESCCCCS(=O)c1sc2nc(cc(C)c2c1N)-c1cccs1