Reaction Details
Target15-hydroxyprostaglandin dehydrogenase [NAD(+)]
LigandBDBM347405
Substrate/Competitorn/a
Meas. Tech.In Vitro Assay
IC50 1.83±n/a nM
Citation Markowitz, SWillson, JKPosner, BReady, JAntczak, MZhang, YDesai, AGerson, SGreenlee, W Compositions and methods of modulating short-chain dehydrogenase activity US Patent US9789116 Publication Date 10/17/2017
 
15-hydroxyprostaglandin dehydrogenase [NAD(+)]
Name:15-hydroxyprostaglandin dehydrogenase [NAD(+)]
Type:Enzyme
Mol. Mass.:28974.46
Organism:Homo sapiens (Human)
Description:P15428
Residue:266
BDBM347405
NameBDBM347405
Synonyms:US10869871, ID # SW209124 US9789116, SW209124
TypeSmall organic molecule
Emp. Form.C17H16N4OS4
Mol. Mass.420.595
SMILESCCCCS(=O)c1sc2nc(cc(-c3nccs3)c2c1N)-c1nccs1