Reaction Details
Target15-hydroxyprostaglandin dehydrogenase [NAD(+)]
LigandBDBM347416
Substrate/Competitorn/a
Meas. Tech.In Vitro Assay
IC50 2.09±n/a nM
Citation Markowitz, SWillson, JKPosner, BReady, JAntczak, MZhang, YDesai, AGerson, SGreenlee, W Compositions and methods of modulating short-chain dehydrogenase activity US Patent US9789116 Publication Date 10/17/2017
 
15-hydroxyprostaglandin dehydrogenase [NAD(+)]
Name:15-hydroxyprostaglandin dehydrogenase [NAD(+)]
Type:Enzyme
Mol. Mass.:28974.46
Organism:Homo sapiens (Human)
Description:P15428
Residue:266
BDBM347416
NameBDBM347416
Synonyms:US10869871, ID # SW209276 US9789116, SW209276
TypeSmall organic molecule
Emp. Form.C21H20N2O2S3
Mol. Mass.428.591
SMILESCOCCC[S+]([O-])c1sc2nc(cc(-c3ccccc3)c2c1N)-c1cccs1