Reaction Details
Target15-hydroxyprostaglandin dehydrogenase [NAD(+)]
LigandBDBM347418
Substrate/Competitorn/a
Meas. Tech.In Vitro Assay
IC50 2.56±n/a nM
Citation Markowitz, SWillson, JKPosner, BReady, JAntczak, MZhang, YDesai, AGerson, SGreenlee, W Compositions and methods of modulating short-chain dehydrogenase activity US Patent US9789116 Publication Date 10/17/2017
 
15-hydroxyprostaglandin dehydrogenase [NAD(+)]
Name:15-hydroxyprostaglandin dehydrogenase [NAD(+)]
Type:Enzyme
Mol. Mass.:28974.46
Organism:Homo sapiens (Human)
Description:P15428
Residue:266
BDBM347418
NameBDBM347418
Synonyms:US10869871, ID # SW209278 US9789116, SW209278
TypeSmall organic molecule
Emp. Form.C19H18N4O2S2
Mol. Mass.398.502
SMILESCCCCS(=O)c1sc2nc(nc(-c3ccccc3)c2c1N)-c1cocn1