Reaction Details
Target15-hydroxyprostaglandin dehydrogenase [NAD(+)]
LigandBDBM347436
Substrate/Competitorn/a
Meas. Tech.In Vitro Assay
IC50 2.30±n/a nM
Citation Markowitz, SWillson, JKPosner, BReady, JAntczak, MZhang, YDesai, AGerson, SGreenlee, W Compositions and methods of modulating short-chain dehydrogenase activity US Patent US9789116 Publication Date 10/17/2017
 
15-hydroxyprostaglandin dehydrogenase [NAD(+)]
Name:15-hydroxyprostaglandin dehydrogenase [NAD(+)]
Type:Enzyme
Mol. Mass.:28974.46
Organism:Homo sapiens (Human)
Description:P15428
Residue:266
BDBM347436
NameBDBM347436
Synonyms:US10869871, ID # SW209428 US9789116, SW209428
TypeSmall organic molecule
Emp. Form.C18H19N5OS3
Mol. Mass.417.571
SMILESCCCCS(=O)c1sc2nc(cc(-c3cnc(C)[nH]3)c2c1N)-c1nccs1