Reaction Details
Target15-hydroxyprostaglandin dehydrogenase [NAD(+)]
LigandBDBM347437
Substrate/Competitorn/a
Meas. Tech.In Vitro Assay
IC50 2.50±n/a nM
Citation Markowitz, SWillson, JKPosner, BReady, JAntczak, MZhang, YDesai, AGerson, SGreenlee, W Compositions and methods of modulating short-chain dehydrogenase activity US Patent US9789116 Publication Date 10/17/2017
 
15-hydroxyprostaglandin dehydrogenase [NAD(+)]
Name:15-hydroxyprostaglandin dehydrogenase [NAD(+)]
Type:Enzyme
Mol. Mass.:28974.46
Organism:Homo sapiens (Human)
Description:P15428
Residue:266
BDBM347437
NameBDBM347437
Synonyms:US10869871, ID # SW209508 US9789116, SW209508
TypeSmall organic molecule
Emp. Form.C24H24N4O2S3
Mol. Mass.496.668
SMILESCCCCS(=O)c1sc2nc(cc(-c3cccc(c3)C(=O)NCC=C)c2c1N)-c1nccs1