Reaction Details
Target15-hydroxyprostaglandin dehydrogenase [NAD(+)]
LigandBDBM347450
Substrate/Competitorn/a
Meas. Tech.In Vitro Assay
IC50 4.06±n/a nM
Citation Markowitz, SWillson, JKPosner, BReady, JAntczak, MZhang, YDesai, AGerson, SGreenlee, W Compositions and methods of modulating short-chain dehydrogenase activity US Patent US9789116 Publication Date 10/17/2017
 
15-hydroxyprostaglandin dehydrogenase [NAD(+)]
Name:15-hydroxyprostaglandin dehydrogenase [NAD(+)]
Type:Enzyme
Mol. Mass.:28974.46
Organism:Homo sapiens (Human)
Description:P15428
Residue:266
BDBM347450
NameBDBM347450
Synonyms:US10869871, ID # SW211689 US9789116, SW211689
TypeSmall organic molecule
Emp. Form.C18H19N5O2S3
Mol. Mass.433.571
SMILESCOCCS(=O)c1sc2nc(cc(-c3cnc(C)n3C)c2c1N)-c1nccs1