Reaction Details
TargetHistone deacetylase 1
LigandBDBM347485
Substrate/Competitorn/a
Meas. Tech.Enzyme Assay
IC50 3.70±n/a nM
Citation van Duzer, JHMazitschek, R Piperidine derivatives as HDAC1/2 inhibitors US Patent US9790180 Publication Date 10/17/2017
 
Histone deacetylase 1
Name:Histone deacetylase 1
Type:Enzyme
Mol. Mass.:55090.27
Organism:Homo sapiens (Human)
Description:Q13547
Residue:482
BDBM347485
NameBDBM347485
Synonyms:US9790180, ID 019 | US9790180, ID 020
TypeSmall organic molecule
Emp. Form.C27H31N5O3S
Mol. Mass.505.632
SMILESNc1ccc(cc1NC(=O)c1ccc(NC2CCN(CC2)C(=O)N2CCOCC2)cc1)-c1cccs1