Reaction Details
TargetcGMP-specific 3',5'-cyclic phosphodiesterase [1-660,682-875]
LigandBDBM15336
Substrate/CompetitorBDBM14391
Meas. Tech.Enzymatic Assay
pH7.8±n/a
Temperature297.15±n/a K
IC50 95000±6000 nM
Km750000±210000 nM
kcat2.3±0.6 1/sec
Citation Wang, HLiu, YHuai, QCai, JZoraghi, RFrancis, SHCorbin, JDRobinson, HXin, ZLin, GKe, H Multiple conformations of phosphodiesterase-5: implications for enzyme function and drug development. J Biol Chem281:21469-79 (2006) 
 
cGMP-specific 3',5'-cyclic phosphodiesterase [1-660,682-875]
Name:cGMP-specific 3',5'-cyclic phosphodiesterase [1-660,682-875]
Type:Enzyme Catalytic Domain
Mol. Mass.:97488.04
Organism:Homo sapiens (Human)
Description:Mutant was generated from wild-type clone and expressed in E. coli.
Residue:854
BDBM15336
BDBM14391
NameBDBM15336
Synonyms:1-methyl-3-(2-methylpropyl)-2,3,6,7-tetrahydro-1H-purine-2,6-dione 3-Isobutyl-1-methylxanthine IBMX | isobutylmethylxanthine
TypeSmall organic molecule
Emp. Form.C10H14N4O2
Mol. Mass.222.2438
SMILESCC(C)Cn1c2nc[nH]c2c(=O)n(C)c1=O