Reaction Details
TargetPhosphatidylinositol 4,5-bisphosphate 3-kinase catalytic subunit delta isoform
LigandBDBM348154
Substrate/Competitorn/a
Meas. Tech.Inhibition Assay
IC50<100±n/a nM
Citation Ren, PLiu, YLi, LChan, KWilson, TE Heterocyclic kinase inhibitors US Patent US9790228 Publication Date 10/17/2017
 
Phosphatidylinositol 4,5-bisphosphate 3-kinase catalytic subunit delta isoform
Name:Phosphatidylinositol 4,5-bisphosphate 3-kinase catalytic subunit delta isoform
Type:Enzyme Subunit
Mol. Mass.:119489.41
Organism:Homo sapiens (Human)
Description:O00329
Residue:1044
BDBM348154
NameBDBM348154
Synonyms:US9790228, Compound 73
TypeSmall organic molecule
Emp. Form.C27H27FN8O
Mol. Mass.498.5547
SMILESCC(c1cc2ccccc2nc1N1CCN(C)CC1)n1nc(-c2cc(O)cc(F)c2)c2c(N)ncnc12