Reaction Details
TargetPhosphatidylinositol 4,5-bisphosphate 3-kinase catalytic subunit gamma isoform
LigandBDBM348154
Substrate/Competitorn/a
Meas. Tech.Inhibition Assay
IC50>1000±n/a nM
Citation Ren, PLiu, YLi, LChan, KWilson, TE Heterocyclic kinase inhibitors US Patent US9790228 Publication Date 10/17/2017
 
Phosphatidylinositol 4,5-bisphosphate 3-kinase catalytic subunit gamma isoform
Name:Phosphatidylinositol 4,5-bisphosphate 3-kinase catalytic subunit gamma isoform
Type:Enzyme Subunit
Mol. Mass.:126470.30
Organism:Homo sapiens (Human)
Description:P48736
Residue:1102
BDBM348154
NameBDBM348154
Synonyms:US9790228, Compound 73
TypeSmall organic molecule
Emp. Form.C27H27FN8O
Mol. Mass.498.5547
SMILESCC(c1cc2ccccc2nc1N1CCN(C)CC1)n1nc(-c2cc(O)cc(F)c2)c2c(N)ncnc12