Reaction Details
TargetPhosphatidylinositol 4-phosphate 3-kinase C2 domain-containing subunit beta
LigandBDBM348220
Substrate/Competitorn/a
Meas. Tech.Inhibition Assay
IC50<100±n/a nM
Citation Ren, PLiu, YLi, LChan, KWilson, TE Heterocyclic kinase inhibitors US Patent US9790228 Publication Date 10/17/2017
 
Phosphatidylinositol 4-phosphate 3-kinase C2 domain-containing subunit beta
Name:Phosphatidylinositol 4-phosphate 3-kinase C2 domain-containing subunit beta
Type:Enzyme
Mol. Mass.:184784.86
Organism:Homo sapiens (Human)
Description:O00750
Residue:1634
BDBM348220
NameBDBM348220
Synonyms:US9790228, Compound 139
TypeSmall organic molecule
Emp. Form.C27H24N10O
Mol. Mass.504.5459
SMILESNc1ncc2cc(ccc2n1)-c1nn(Cc2cc3ccccc3nc2N2CCOCC2)c2ncnc(N)c12