Reaction Details
TargetPhosphatidylinositol 4-phosphate 3-kinase C2 domain-containing subunit beta
LigandBDBM50323731
Substrate/Competitorn/a
Meas. Tech.Inhibition Assay
IC50<100±n/a nM
Citation Ren, PLiu, YLi, LChan, KWilson, TE Heterocyclic kinase inhibitors US Patent US9790228 Publication Date 10/17/2017
 
Phosphatidylinositol 4-phosphate 3-kinase C2 domain-containing subunit beta
Name:Phosphatidylinositol 4-phosphate 3-kinase C2 domain-containing subunit beta
Type:Enzyme
Mol. Mass.:184784.86
Organism:Homo sapiens (Human)
Description:O00750
Residue:1634
BDBM50323731
NameBDBM50323731
Synonyms:CHEMBL1213117 N-[6-(4-amino-1-{[2-(4-methylpiperazin-1-yl)quinolin-3-yl]methyl}-1H-pyrazolo[3,4-d]pyrimidin-3-yl)-1,3-benzothiazol-2-yl]acetamide | US9790228, Compound 198
TypeSmall organic molecule
Emp. Form.C29H28N10OS
Mol. Mass.564.664
SMILESCN1CCN(CC1)c1nc2ccccc2cc1Cn1nc(-c2ccc3nc(NC(C)=O)sc3c2)c2c(N)ncnc12