Reaction Details
TargetN-acetyltransferase Eis
LigandBDBM349590
Substrate/Competitorn/a
Meas. Tech.Eis inhibition assay
IC50 10600±n/a nM
Citation Garneau-Tsodikova, STsodikov, OVPosey, JE Eis inhibitors US Patent US10208000 Publication Date 2/19/2019
 
N-acetyltransferase Eis
Name:N-acetyltransferase Eis
Type:PROTEIN
Mol. Mass.:43803.37
Organism:Mycobacterium tuberculosis (strain ATCC 25618 / H37Rv)
Description:ChEMBL_116995
Residue:402
BDBM349590
NameBDBM349590
Synonyms:US10208000, Compound 32
TypeSmall organic molecule
Emp. Form.C17H17N3O4S
Mol. Mass.359.4
SMILESCC(C)c1ccc(NS(=O)(=O)c2ccc3[nH]c(=O)c(=O)[nH]c3c2)cc1