Reaction Details
TargetN-acetyltransferase Eis
LigandBDBM349593
Substrate/Competitorn/a
Meas. Tech.Eis inhibition assay
IC50 250±n/a nM
Citation Garneau-Tsodikova, STsodikov, OVPosey, JE Eis inhibitors US Patent US10208000 Publication Date 2/19/2019
 
N-acetyltransferase Eis
Name:N-acetyltransferase Eis
Type:PROTEIN
Mol. Mass.:43803.37
Organism:Mycobacterium tuberculosis (strain ATCC 25618 / H37Rv)
Description:ChEMBL_116995
Residue:402
BDBM349593
NameBDBM349593
Synonyms:US10208000, Compound 35
TypeSmall organic molecule
Emp. Form.C18H19N3O4S
Mol. Mass.373.426
SMILESCC(C)c1ccc(cc1)N(C)S(=O)(=O)c1ccc2[nH]c(=O)c(=O)[nH]c2c1