Reaction Details
TargetN-acetyltransferase Eis
LigandBDBM349596
Substrate/Competitorn/a
Meas. Tech.Eis inhibition assay
IC50 56.0±n/a nM
Citation Garneau-Tsodikova, STsodikov, OVPosey, JE Eis inhibitors US Patent US10208000 Publication Date 2/19/2019
 
N-acetyltransferase Eis
Name:N-acetyltransferase Eis
Type:PROTEIN
Mol. Mass.:43803.37
Organism:Mycobacterium tuberculosis (strain ATCC 25618 / H37Rv)
Description:ChEMBL_116995
Residue:402
BDBM349596
NameBDBM349596
Synonyms:US10208000, Compound 38
TypeSmall organic molecule
Emp. Form.C15H12BrN3O4S
Mol. Mass.410.242
SMILESCN(c1cccc(Br)c1)S(=O)(=O)c1ccc2[nH]c(=O)c(=O)[nH]c2c1