Reaction Details
TargetN-acetyltransferase Eis
LigandBDBM349605
Substrate/Competitorn/a
Meas. Tech.Eis inhibition assay
IC50 300±n/a nM
Citation Garneau-Tsodikova, STsodikov, OVPosey, JE Eis inhibitors US Patent US10208000 Publication Date 2/19/2019
 
N-acetyltransferase Eis
Name:N-acetyltransferase Eis
Type:PROTEIN
Mol. Mass.:43803.37
Organism:Mycobacterium tuberculosis (strain ATCC 25618 / H37Rv)
Description:ChEMBL_116995
Residue:402
BDBM349605
NameBDBM349605
Synonyms:US10208000, Compound 47
TypeSmall organic molecule
Emp. Form.C20H17N3O5S
Mol. Mass.411.431
SMILESCOc1cc(cc2ccccc12)N(C)S(=O)(=O)c1ccc2[nH]c(=O)c(=O)[nH]c2c1