Reaction Details
TargetCoagulation factor X
LigandBDBM15836
Substrate/CompetitorBDBM12500
Meas. Tech.Factor Xa Inhibition Assay
Ki 125±n/a nM
Citation Nazare, MEssrich, MWill, DWMatter, HRitter, KUrmann, MBauer, ASchreuder, HCzech, JLorenz, MLaux, VWehner, V Novel factor Xa inhibitors based on a 2-carboxyindole scaffold: SAR of P4 substituents in combination with a neutral P1 ligand. Bioorg Med Chem Lett14:4197-201 (2004) 
 
Coagulation factor X
Name:Coagulation factor X
Type:Enzyme
Mol. Mass.:54726.60
Organism:Homo sapiens (Human)
Description:n/a
Residue:488
BDBM15836
BDBM12500
NameBDBM15836
Synonyms:1-{[5-(5-chlorothiophen-2-yl)-1,2-oxazol-3-yl]methyl}-N-(1-methanesulfonylpiperidin-4-yl)-1H-indole-2-carboxamide | 2-carboxyindole-based inhibitor 21
TypeSmall organic molecule
Emp. Form.C23H23ClN4O4S2
Mol. Mass.519.036
SMILESCS(=O)(=O)N1CCC(CC1)NC(=O)c1cc2ccccc2n1Cc1cc(on1)-c1ccc(Cl)s1