Reaction Details
TargetCoagulation factor X
LigandBDBM15860
Substrate/CompetitorBDBM12500
Meas. Tech.Factor Xa Inhibition Assay
pH7.8±n/a
Temperature298.15±n/a K
Ki 2230±n/a nM
Citation Nazare, MEssrich, MWill, DWMatter, HRitter, KUrmann, MBauer, ASchreuder, HDudda, ACzech, JLorenz, MLaux, VWehner, V Factor Xa inhibitors based on a 2-carboxyindole scaffold: SAR of neutral P1 substituents. Bioorg Med Chem Lett14:4191-5 (2004) 
 
Coagulation factor X
Name:Coagulation factor X
Type:Enzyme
Mol. Mass.:54726.60
Organism:Homo sapiens (Human)
Description:n/a
Residue:488
BDBM15860
BDBM12500
NameBDBM15860
Synonyms:1-{[3-(4-chlorophenyl)-1,2,4-oxadiazol-5-yl]methyl}-N-[1-(propan-2-yl)piperidin-4-yl]-1H-indole-2-carboxamide | 2-carboxyindole 20
TypeSmall organic molecule
Emp. Form.C26H28ClN5O2
Mol. Mass.477.986
SMILESCC(C)N1CCC(CC1)NC(=O)c1cc2ccccc2n1Cc1nc(no1)-c1ccc(Cl)cc1