Reaction Details
TargetSerine/threonine-protein kinase haspin
LigandBDBM350203
Substrate/Competitorn/a
Meas. Tech.Haspin Kinase Assay
IC50 151±n/a nM
Citation Pastor Fernández, JMartínez González, SBlanco-Aparicio, CHernández Higueras, AIGómez De La Oliva, CARivero Buceta, VRiesco Fagundo, RC Condensed tricyclic compounds as protein kinase inhibitors US Patent US10208056 Publication Date 2/19/2019
 
Serine/threonine-protein kinase haspin
Name:Serine/threonine-protein kinase haspin
Type:PROTEIN
Mol. Mass.:88531.28
Organism:Homo sapiens (Human)
Description:ChEMBL_1510616
Residue:798
BDBM350203
NameBDBM350203
Synonyms:US10208056, Compound 35
TypeSmall organic molecule
Emp. Form.C13H11ClN2O3
Mol. Mass.278.691
SMILESCC1(C)Oc2cncc(Cl)c2-c2[nH]c(cc12)C(O)=O