Reaction Details
TargetSerine/threonine-protein kinase haspin
LigandBDBM350224
Substrate/Competitorn/a
Meas. Tech.Haspin Kinase Assay
IC50 52.9±n/a nM
Citation Pastor Fernández, JMartínez González, SBlanco-Aparicio, CHernández Higueras, AIGómez De La Oliva, CARivero Buceta, VRiesco Fagundo, RC Condensed tricyclic compounds as protein kinase inhibitors US Patent US10208056 Publication Date 2/19/2019
 
Serine/threonine-protein kinase haspin
Name:Serine/threonine-protein kinase haspin
Type:PROTEIN
Mol. Mass.:88531.28
Organism:Homo sapiens (Human)
Description:ChEMBL_1510616
Residue:798
BDBM350224
NameBDBM350224
Synonyms:US10208056, Compound 54
TypeSmall organic molecule
Emp. Form.C15H17N3O2
Mol. Mass.271.3144
SMILESCC(C)C1(C)Oc2cnccc2-c2[nH]c(cc12)C(N)=O