Reaction Details
TargetCyclin-C/Cyclin-dependent kinase 19
LigandBDBM350224
Substrate/Competitorn/a
Meas. Tech.CDK19/Cyclin C Binding Assay
IC50 97.1±n/a nM
Citation Pastor Fernández, JMartínez González, SBlanco-Aparicio, CHernández Higueras, AIGómez De La Oliva, CARivero Buceta, VRiesco Fagundo, RC Condensed tricyclic compounds as protein kinase inhibitors US Patent US10208056 Publication Date 2/19/2019
 
Cyclin-C/Cyclin-dependent kinase 19
Name:Cyclin-C/Cyclin-dependent kinase 19
Synonyms:CDK19/Cyclin C
Type:Protein
Mol. Mass.:n/a
Description:n/a
Components:This complex has 2 components.
Component 1
Name:Cyclin-dependent kinase 19
Type:Serine/Threonine protein kinase
Mol. Mass.:56816.68
Organism:Homo sapiens (Human)
Description:Q9BWU1
Residue:502
Component 2
Name:Cyclin-C
Synonyms:CCNC Cyclin C hSRB11
Type:PROTEIN
Mol. Mass.:33244.88
Organism:Homo sapiens (Human)
Description:ChEMBL_107900
Residue:283
BDBM350224
NameBDBM350224
Synonyms:US10208056, Compound 54
TypeSmall organic molecule
Emp. Form.C15H17N3O2
Mol. Mass.271.3144
SMILESCC(C)C1(C)Oc2cnccc2-c2[nH]c(cc12)C(N)=O