Reaction Details
TargetSerine/threonine-protein kinase haspin
LigandBDBM350253
Substrate/Competitorn/a
Meas. Tech.Haspin Kinase Assay
IC50 9.56±n/a nM
Citation Pastor Fernández, JMartínez González, SBlanco-Aparicio, CHernández Higueras, AIGómez De La Oliva, CARivero Buceta, VRiesco Fagundo, RC Condensed tricyclic compounds as protein kinase inhibitors US Patent US10208056 Publication Date 2/19/2019
 
Serine/threonine-protein kinase haspin
Name:Serine/threonine-protein kinase haspin
Type:PROTEIN
Mol. Mass.:88531.28
Organism:Homo sapiens (Human)
Description:ChEMBL_1510616
Residue:798
BDBM350253
NameBDBM350253
Synonyms:US10208056, Compound 80
TypeSmall organic molecule
Emp. Form.C18H21N3O2
Mol. Mass.311.3782
SMILESCCn1c(cc2c1-c1ccncc1OC21CCCCC1)C(N)=O