Reaction Details
TargetSerine/threonine-protein kinase haspin
LigandBDBM350266
Substrate/Competitorn/a
Meas. Tech.Haspin Kinase Assay
IC50 17.5±n/a nM
Citation Pastor Fernández, JMartínez González, SBlanco-Aparicio, CHernández Higueras, AIGómez De La Oliva, CARivero Buceta, VRiesco Fagundo, RC Condensed tricyclic compounds as protein kinase inhibitors US Patent US10208056 Publication Date 2/19/2019
 
Serine/threonine-protein kinase haspin
Name:Serine/threonine-protein kinase haspin
Type:PROTEIN
Mol. Mass.:88531.28
Organism:Homo sapiens (Human)
Description:ChEMBL_1510616
Residue:798
BDBM350266
NameBDBM350266
Synonyms:US10208056, Compound 94
TypeSmall organic molecule
Emp. Form.C18H21N3O2
Mol. Mass.311.3782
SMILESCCn1c(C(N)=O)c(C2CC2)c2c1-c1ccncc1OC2(C)C