Reaction Details
TargetSerine/threonine-protein kinase haspin
LigandBDBM350268
Substrate/Competitorn/a
Meas. Tech.Haspin Kinase Assay
IC50 355±n/a nM
Citation Pastor Fernández, JMartínez González, SBlanco-Aparicio, CHernández Higueras, AIGómez De La Oliva, CARivero Buceta, VRiesco Fagundo, RC Condensed tricyclic compounds as protein kinase inhibitors US Patent US10208056 Publication Date 2/19/2019
 
Serine/threonine-protein kinase haspin
Name:Serine/threonine-protein kinase haspin
Type:PROTEIN
Mol. Mass.:88531.28
Organism:Homo sapiens (Human)
Description:ChEMBL_1510616
Residue:798
BDBM350268
NameBDBM350268
Synonyms:US10208056, Compound 96
TypeSmall organic molecule
Emp. Form.C18H21N3O3
Mol. Mass.327.3776
SMILESCCn1c(cc2[C@H](Oc3cnccc3-c12)C1CCOCC1)C(N)=O