Reaction Details
TargetSerine/threonine-protein kinase haspin
LigandBDBM350269
Substrate/Competitorn/a
Meas. Tech.Haspin Kinase Assay
IC50 8.91±n/a nM
Citation Pastor Fernández, JMartínez González, SBlanco-Aparicio, CHernández Higueras, AIGómez De La Oliva, CARivero Buceta, VRiesco Fagundo, RC Condensed tricyclic compounds as protein kinase inhibitors US Patent US10208056 Publication Date 2/19/2019
 
Serine/threonine-protein kinase haspin
Name:Serine/threonine-protein kinase haspin
Type:PROTEIN
Mol. Mass.:88531.28
Organism:Homo sapiens (Human)
Description:ChEMBL_1510616
Residue:798
BDBM350269
NameBDBM350269
Synonyms:US10208056, Compound 104
TypeSmall organic molecule
Emp. Form.C17H18ClN3O3
Mol. Mass.347.796
SMILESCCn1c(C(N)=O)c(Cl)c2c1-c1ccncc1OC21CCOCC1