Reaction Details
TargetPhosphatidylinositol 4,5-bisphosphate 3-kinase catalytic subunit delta isoform
LigandBDBM350392
Substrate/Competitorn/a
Meas. Tech.Transcreener KINASE Assay
IC50 1.000±n/a nM
Citation Su, WDai, GZhang, WDeng, W Imidazopyridazine compounds and their use US Patent US10208066 Publication Date 2/19/2019
 
Phosphatidylinositol 4,5-bisphosphate 3-kinase catalytic subunit delta isoform
Name:Phosphatidylinositol 4,5-bisphosphate 3-kinase catalytic subunit delta isoform
Type:Enzyme Subunit
Mol. Mass.:119489.41
Organism:Homo sapiens (Human)
Description:O00329
Residue:1044
BDBM350392
NameBDBM350392
Synonyms:(S)-4-amino-6-((1-(6-phenylimidazo[1,2-b]pyridazin-7-yl)propyl)amino)pyrimidine-5-carbonitrile US10611777, Compound 6
TypeSmall organic molecule
Emp. Form.C20H17ClN8
Mol. Mass.404.856
SMILESCC[C@H](Nc1ncnc(N)c1C#N)c1cc2ncc(Cl)n2nc1-c1ccccc1