Reaction Details
TargetPhosphatidylinositol 4,5-bisphosphate 3-kinase catalytic subunit delta isoform
LigandBDBM350395
Substrate/Competitorn/a
Meas. Tech.Transcreener KINASE Assay
IC50 3.00±n/a nM
Citation Su, WDai, GZhang, WDeng, W Imidazopyridazine compounds and their use US Patent US10208066 Publication Date 2/19/2019
 
Phosphatidylinositol 4,5-bisphosphate 3-kinase catalytic subunit delta isoform
Name:Phosphatidylinositol 4,5-bisphosphate 3-kinase catalytic subunit delta isoform
Type:Enzyme Subunit
Mol. Mass.:119489.41
Organism:Homo sapiens (Human)
Description:O00329
Residue:1044
BDBM350395
NameBDBM350395
Synonyms:US10208066, Compound 11
TypeSmall organic molecule
Emp. Form.C19H15ClN8
Mol. Mass.390.829
SMILESC[C@H](Nc1ncnc2[nH]cnc12)c1cc2ncc(Cl)n2nc1-c1ccccc1