Reaction Details
TargetPhosphatidylinositol 4,5-bisphosphate 3-kinase catalytic subunit delta isoform
LigandBDBM350412
Substrate/Competitorn/a
Meas. Tech.Transcreener KINASE Assay
IC50 3.00±n/a nM
Citation Su, WDai, GZhang, WDeng, W Imidazopyridazine compounds and their use US Patent US10208066 Publication Date 2/19/2019
 
Phosphatidylinositol 4,5-bisphosphate 3-kinase catalytic subunit delta isoform
Name:Phosphatidylinositol 4,5-bisphosphate 3-kinase catalytic subunit delta isoform
Type:Enzyme Subunit
Mol. Mass.:119489.41
Organism:Homo sapiens (Human)
Description:O00329
Residue:1044
BDBM350412
NameBDBM350412
Synonyms:(S)-4-amino-6-((1-(3-chloro-6-(3,5-difluorophenyl)imidazo[1,2-b]pyridazin-7-yl)ethyl)amino)pyrimidine-5-carbonitrile US10611777, Compound 30
TypeSmall organic molecule
Emp. Form.C19H13ClF2N8
Mol. Mass.426.81
SMILESC[C@H](Nc1ncnc(N)c1C#N)c1cc2ncc(Cl)n2nc1-c1cc(F)cc(F)c1