Reaction Details
TargetPhosphatidylinositol 4,5-bisphosphate 3-kinase catalytic subunit delta isoform
LigandBDBM350427
Substrate/Competitorn/a
Meas. Tech.Transcreener KINASE Assay
IC50 4.00±n/a nM
Citation Su, WDai, GZhang, WDeng, W Imidazopyridazine compounds and their use US Patent US10208066 Publication Date 2/19/2019
 
Phosphatidylinositol 4,5-bisphosphate 3-kinase catalytic subunit delta isoform
Name:Phosphatidylinositol 4,5-bisphosphate 3-kinase catalytic subunit delta isoform
Type:Enzyme Subunit
Mol. Mass.:119489.41
Organism:Homo sapiens (Human)
Description:O00329
Residue:1044
BDBM350427
NameBDBM350427
Synonyms:US10208066, Compound 46 | US10611777, Compound 46
TypeSmall organic molecule
Emp. Form.C20H17ClN8O2S
Mol. Mass.468.919
SMILESC[C@H](Nc1ncnc(N)c1C#N)c1cc2ncc(Cl)n2nc1-c1cccc(c1)S(C)(=O)=O