Reaction Details
TargetPhosphatidylinositol 4,5-bisphosphate 3-kinase catalytic subunit delta isoform
LigandBDBM350454
Substrate/Competitorn/a
Meas. Tech.Transcreener KINASE Assay
IC50 1.000±n/a nM
Citation Su, WDai, GZhang, WDeng, W Imidazopyridazine compounds and their use US Patent US10208066 Publication Date 2/19/2019
 
Phosphatidylinositol 4,5-bisphosphate 3-kinase catalytic subunit delta isoform
Name:Phosphatidylinositol 4,5-bisphosphate 3-kinase catalytic subunit delta isoform
Type:Enzyme Subunit
Mol. Mass.:119489.41
Organism:Homo sapiens (Human)
Description:O00329
Residue:1044
BDBM350454
NameBDBM350454
Synonyms:(S)-4-amino-6-(0-(3-fluoro-6-phenylimidazo[1,2-b]pyridazin-7-yl)ethyl)amino)pyrimidine-5-carbonitrile US10611777, Compound 78
TypeSmall organic molecule
Emp. Form.C19H15FN8
Mol. Mass.374.3744
SMILESC[C@H](Nc1ncnc(N)c1C#N)c1cc2ncc(F)n2nc1-c1ccccc1