Reaction Details
TargetPhosphatidylinositol 4,5-bisphosphate 3-kinase catalytic subunit gamma isoform
LigandBDBM350457
Substrate/Competitorn/a
Meas. Tech.Transcreener KINASE Assay
IC50 98.0±n/a nM
Citation Su, WDai, GZhang, WDeng, W Imidazopyridazine compounds and their use US Patent US10208066 Publication Date 2/19/2019
 
Phosphatidylinositol 4,5-bisphosphate 3-kinase catalytic subunit gamma isoform
Name:Phosphatidylinositol 4,5-bisphosphate 3-kinase catalytic subunit gamma isoform
Type:Enzyme Subunit
Mol. Mass.:126470.30
Organism:Homo sapiens (Human)
Description:P48736
Residue:1102
BDBM350457
NameBDBM350457
Synonyms:(S)-N4-(1-(3-chloro-6-phenylimidazo[1,2-b]pyridazin-7-yl)ethyl)-5-(5-methyl-1,3,4-oxadiazol-2-yl)pyrimidine-4,6-diamine | US10208066, Compound 81
TypeSmall organic molecule
Emp. Form.C21H18ClN9O
Mol. Mass.447.88
SMILESC[C@H](Nc1ncnc(N)c1-c1nnc(C)o1)c1cc2ncc(Cl)n2nc1-c1ccccc1