Reaction Details
TargetPhosphatidylinositol 3-kinase regulatory subunit beta
LigandBDBM350457
Substrate/Competitorn/a
Meas. Tech.Transcreener KINASE Assay
IC50 630±n/a nM
Citation Su, WDai, GZhang, WDeng, W Imidazopyridazine compounds and their use US Patent US10208066 Publication Date 2/19/2019
 
Phosphatidylinositol 3-kinase regulatory subunit beta
Name:Phosphatidylinositol 3-kinase regulatory subunit beta
Type:Enzyme Subunit
Mol. Mass.:81542.75
Organism:Homo sapiens (Human)
Description:O00459
Residue:728
BDBM350457
NameBDBM350457
Synonyms:(S)-N4-(1-(3-chloro-6-phenylimidazo[1,2-b]pyridazin-7-yl)ethyl)-5-(5-methyl-1,3,4-oxadiazol-2-yl)pyrimidine-4,6-diamine | US10208066, Compound 81
TypeSmall organic molecule
Emp. Form.C21H18ClN9O
Mol. Mass.447.88
SMILESC[C@H](Nc1ncnc(N)c1-c1nnc(C)o1)c1cc2ncc(Cl)n2nc1-c1ccccc1