Reaction Details
TargetDihydroorotate dehydrogenase (quinone), mitochondrial
LigandBDBM16104
Substrate/CompetitorBDBM16100
Meas. Tech.DHODH Inhibition Assay
pH8±n/a
Temperature295.15±n/a K
Ki 4000±1000 nM
Km6600±700 nM
kcat15.4±0.2 1/sec
CommentsMixed inhibition.
Citation Hurt, DESutton, AEClardy, J Brequinar derivatives and species-specific drug design for dihydroorotate dehydrogenase. Bioorg Med Chem Lett16:1610-5 (2006) 
 
Dihydroorotate dehydrogenase (quinone), mitochondrial
Name:Dihydroorotate dehydrogenase (quinone), mitochondrial
Type:Enzyme
Mol. Mass.:42881.33
Organism:Homo sapiens (Human)
Description:Q02127
Residue:395
BDBM16104
BDBM16100
NameBDBM16104
Synonyms:3-[3-(4-tert-butylphenyl)phenyl]-5-carbamoylbenzoic acid AMX01 | Brequinar-derived asymmetric terphenyl compound
TypeSmall organic molecule
Emp. Form.C24H23NO3
Mol. Mass.373.4443
SMILESCC(C)(C)c1ccc(cc1)-c1cccc(c1)-c1cc(cc(c1)C(O)=O)C(N)=O