Reaction Details
TargetTyrosine-protein kinase BTK
LigandBDBM350873
Substrate/Competitorn/a
Meas. Tech.Kinase Inhibition Assay
Ki<100±n/a nM
Citation Laurent, ARose, Y Protein kinase inhibitors US Patent US9795608 Publication Date 10/24/2017
 
Tyrosine-protein kinase BTK
Name:Tyrosine-protein kinase BTK
Type:Enzyme
Mol. Mass.:76289.95
Organism:Homo sapiens (Human)
Description:Q06187
Residue:659
BDBM350873
NameBDBM350873
Synonyms:US9795608, Compound 3
TypeSmall organic molecule
Emp. Form.C27H25FN6O3S
Mol. Mass.532.589
SMILESCc1ncc(COc2cc(F)cc(Oc3ccc(cc3)-n3nc(C4CCOCC4)c4ncnc(N)c34)c2)s1