Reaction Details
TargetHigh affinity cAMP-specific 3',5'-cyclic phosphodiesterase 7A
LigandBDBM350906
Substrate/Competitorn/a
Meas. Tech.Inhibition Assay
IC50 90.0±n/a nM
Citation Martinez Gil, AGil Ayuso-Gontan, CBPerez Fernandez, DIGarcia Fernandez, AM S-substituted quinazolines and their therapeutic applications for the treatment of diseases mediated by PDE7 US Patent US9796687 Publication Date 10/24/2017
 
High affinity cAMP-specific 3',5'-cyclic phosphodiesterase 7A
Name:High affinity cAMP-specific 3',5'-cyclic phosphodiesterase 7A
Type:Enzyme
Mol. Mass.:55514.96
Organism:Homo sapiens (Human)
Description:Q13946
Residue:482
BDBM350906
NameBDBM350906
Synonyms:3-Phenyl-2-(2-naphthylmethylthio)-4-oxo-3,4-dihydroquinazoline | US9796687, Compound 28
TypeSmall organic molecule
Emp. Form.C25H18N2OS
Mol. Mass.394.488
SMILESO=c1n(c(SCc2ccc3ccccc3c2)nc2ccccc12)-c1ccccc1