Reaction Details
TargetMitogen-activated protein kinase 3
LigandBDBM350911
Substrate/Competitorn/a
Meas. Tech.Omnia Assay
IC50<100±n/a nM
Citation Haq, NNiu, DPetter, RCQiao, LSingh, JZhu, Z ERK inhibitors and uses thereof US Patent US9796700 Publication Date 10/24/2017
 
Mitogen-activated protein kinase 3
Name:Mitogen-activated protein kinase 3
Type:Protein
Mol. Mass.:43136.58
Organism:Homo sapiens (Human)
Description:curated by PDB 4QTB
Residue:379
BDBM350911
NameBDBM350911
Synonyms:US9796700, Compound I-5
TypeSmall organic molecule
Emp. Form.C21H22F4N6O2
Mol. Mass.466.432
SMILESNC(=O)C1CCCC(C1)Nc1ncc(c(Nc2ccc(F)cc2NC(=O)C=C)n1)C(F)(F)F