Reaction Details
TargetAldo-keto reductase family 1 member B1
LigandBDBM16415
Substrate/CompetitorBDBM16416
Meas. Tech.Enzyme Inhibition Assay
pH7±n/a
Temperature298.15±n/a K
Ki 2000±100 nM
Citation Brownlee, JMCarlson, EMilne, ACPape, EHarrison, DH Structural and thermodynamic studies of simple aldose reductase-inhibitor complexes. Bioorg Chem34:424-44 (2006) 
 
Aldo-keto reductase family 1 member B1
Name:Aldo-keto reductase family 1 member B1
Type:Protein
Mol. Mass.:35855.50
Organism:Homo sapiens (Human)
Description:P15121. 4LAU; 2IKI; 4LB4; 2FZD; 2FZ8; 1US0
Residue:316
BDBM16415
BDBM16416
NameBDBM16415
Synonyms:(1,3-dioxo-1H-benzo[de]isoquinolin-2(3H)-yl)acetic acid Alrestatin PiG Tocris-0485
TypeSmall organic molecule
Emp. Form.C14H9NO4
Mol. Mass.255.2256
SMILESOC(=O)CN1C(=O)c2cccc3cccc(C1=O)c23