Reaction Details
TargetAldo-keto reductase family 1 member B1
LigandBDBM16437
Substrate/CompetitorBDBM16418
Meas. Tech.Enzyme Inhibition Assay
Ki 8100±n/a nM
Citation Brownlee, JMCarlson, EMilne, ACPape, EHarrison, DH Structural and thermodynamic studies of simple aldose reductase-inhibitor complexes. Bioorg Chem34:424-44 (2006) 
 
Aldo-keto reductase family 1 member B1
Name:Aldo-keto reductase family 1 member B1
Type:Protein
Mol. Mass.:35855.50
Organism:Homo sapiens (Human)
Description:P15121. 4LAU; 2IKI; 4LB4; 2FZD; 2FZ8; 1US0
Residue:316
BDBM16437
BDBM16418
NameBDBM16437
Synonyms:2-{3-[(2-hydroxyethyl)sulfanyl]-2,5-dioxopyrrolidin-1-yl}acetic acid | beta-Mercaptoethanol , N-glycylthiosuccinimide
Typeadduct
Emp. Form.C8H11NO5S
Mol. Mass.233.242
SMILESOCCSC1CC(=O)N(CC(O)=O)C1=O