Reaction Details
TargetTyrosine-protein kinase BTK
LigandBDBM351881
Substrate/Competitorn/a
Meas. Tech.Fluorescence Polarization-Based Kinase Assay
Ki<100±n/a nM
Citation Laurent, ARose, YJaquith, JB Selective inhibitors of Tec and Src protein kinase families US Patent US9796716 Publication Date 10/24/2017
 
Tyrosine-protein kinase BTK
Name:Tyrosine-protein kinase BTK
Type:Enzyme
Mol. Mass.:76289.95
Organism:Homo sapiens (Human)
Description:Q06187
Residue:659
BDBM351881
NameBDBM351881
Synonyms:US9796716, Compound 126
TypeSmall organic molecule
Emp. Form.C29H27FN6O3
Mol. Mass.526.5615
SMILESCc1ccc(COc2cc(F)cc(Oc3ccc(cc3)-c3nn(CC4(C)COC4)c4ncnc(N)c34)c2)cn1