Reaction Details
TargetGlucocorticoid receptor
LigandBDBM351891
Substrate/Competitorn/a
Meas. Tech.Binding Assay
Ki 2.34±n/a nM
Citation Yang, MGXiao, ZWeinstein, DS Imidazole-derived modulators of the glucocorticoid receptor US Patent US9796720 Publication Date 10/24/2017
 
Glucocorticoid receptor
Name:Glucocorticoid receptor
Type:Enzyme
Mol. Mass.:85656.87
Organism:Homo sapiens (Human)
Description:P04150
Residue:777
BDBM351891
NameBDBM351891
Synonyms:(S)-2-(9-Fluoro-2-(4-(morpholine-4-carbonyl)phenyl)-5H-chromeno[2,3-b]pyridin-5-yl)-2-methylpropanoic acid | US9796720, 6
TypeSmall organic molecule
Emp. Form.C28H24FN5O3S
Mol. Mass.529.585
SMILESCCS(=O)(=O)c1ccc(cc1)-c1ccc2[C@H](c3cccc(F)c3Oc2n1)C(C)(C)c1nc2nccnc2[nH]1