Reaction Details
TargetGlucocorticoid receptor
LigandBDBM351905
Substrate/Competitorn/a
Meas. Tech.Binding Assay
Ki 1.40±n/a nM
Citation Yang, MGXiao, ZWeinstein, DS Imidazole-derived modulators of the glucocorticoid receptor US Patent US9796720 Publication Date 10/24/2017
 
Glucocorticoid receptor
Name:Glucocorticoid receptor
Type:Enzyme
Mol. Mass.:85656.87
Organism:Homo sapiens (Human)
Description:P04150
Residue:777
BDBM351905
NameBDBM351905
Synonyms:(S)-5-(2-(1H-Imidazo[4,5-b]pyrazin-2-yl)propan-2-yl)-9-fluoro-2-phenyl-5H-chromeno[2,3-b]pyridine | US9796720, 20
TypeSmall organic molecule
Emp. Form.C26H20FN5O
Mol. Mass.437.4683
SMILESCC(C)([C@@H]1c2ccc(nc2Oc2c(F)cccc12)-c1ccccc1)c1nc2nccnc2[nH]1