Reaction Details
TargetGlucocorticoid receptor
LigandBDBM351908
Substrate/Competitorn/a
Meas. Tech.Binding Assay
Ki 1.76±n/a nM
Citation Yang, MGXiao, ZWeinstein, DS Imidazole-derived modulators of the glucocorticoid receptor US Patent US9796720 Publication Date 10/24/2017
 
Glucocorticoid receptor
Name:Glucocorticoid receptor
Type:Enzyme
Mol. Mass.:85656.87
Organism:Homo sapiens (Human)
Description:P04150
Residue:777
BDBM351908
NameBDBM351908
Synonyms:(S)-N-(4-(5-(2-(1H-Imidazo[4,5-b]pyrazin-2-yl)propan-2-yl)-9-fluoro-5H-chromeno[2,3-b]pyridin-2-yl)phenyl)methanesulfonamide | US9796720, 23
TypeSmall organic molecule
Emp. Form.C27H23FN6O3S
Mol. Mass.530.573
SMILESCC(C)([C@@H]1c2ccc(nc2Oc2c(F)cccc12)-c1ccc(NS(C)(=O)=O)cc1)c1nc2nccnc2[nH]1