Reaction Details
TargetGlucocorticoid receptor
LigandBDBM351916
Substrate/Competitorn/a
Meas. Tech.Binding Assay
Ki 1.94±n/a nM
Citation Yang, MGXiao, ZWeinstein, DS Imidazole-derived modulators of the glucocorticoid receptor US Patent US9796720 Publication Date 10/24/2017
 
Glucocorticoid receptor
Name:Glucocorticoid receptor
Type:Enzyme
Mol. Mass.:85656.87
Organism:Homo sapiens (Human)
Description:P04150
Residue:777
BDBM351916
NameBDBM351916
Synonyms:(S)-5-(2-(1H-Imidazo[4,5-b]pyrazin-2-yl)propan-2-yl)-9-fluoro-2-(4-(1-methyl-1H-tetrazol-5-yl)phenyl)-5H-chromeno[2,3-b]pyridine | US9796720, 31
TypeSmall organic molecule
Emp. Form.C28H22FN9O
Mol. Mass.519.5324
SMILESCn1nnnc1-c1ccc(cc1)-c1ccc2[C@H](c3cccc(F)c3Oc2n1)C(C)(C)c1nc2nccnc2[nH]1