Reaction Details
TargetBeta-secretase 2
LigandBDBM228057
Substrate/Competitorn/a
Meas. Tech.BACE-2 Assay
pH5±n/a
Ki 0.760±n/a nM
Commentsextracted
Citation Dai, XCumming, JNLiu, HScott, JD C5-C6-oxacyclic fused iminopyrimidinone compounds as bace inhibitors, compositions, and their use US Patent US10047098 Publication Date 8/14/2018
 
Beta-secretase 2
Name:Beta-secretase 2
Type:Protein
Mol. Mass.:56171.20
Organism:Homo sapiens (Human)
Description:Q9Y5Z0
Residue:518
BDBM228057
NameBDBM228057
Synonyms:US10047098, 85
TypeSmall organic molecule
Emp. Form.C24H25F2N3O3
Mol. Mass.441.4704
SMILESCN1C(=N)N[C@]2(CO[C@H](C[C@H]2C1=O)c1ccc(F)cc1)c1cc(OCC2CC2)ccc1F