Reaction Details
TargetSUMO-activating enzyme subunit 2
LigandBDBM329853
Substrate/Competitorn/a
Meas. Tech.HTRF Assay
IC50<10±n/a nM
Citation Afroze, RBharathan, ITCiavarri, JPFleming, PEGaulin, JLGirard, MLangston, SPSoucy, FWong, TYe, Y Pyrazolopyrimidinyl inhibitors of ubiquitin-activating enzyme US Patent US9796725 Publication Date 10/24/2017
 
SUMO-activating enzyme subunit 2
Name:SUMO-activating enzyme subunit 2
Type:Enzyme
Mol. Mass.:71206.17
Organism:Homo sapiens (Human)
Description:Q9UBT2
Residue:640
BDBM329853
NameBDBM329853
Synonyms:(rac)-((1R,2R,3S,4R)-4-((2-(Benzo[b]thiophen-4-yl)pyrazolo[1,5-a]pyrimidin-7- US9663525, Compound I-061 | US9796725, Compound I-061
TypeSmall organic molecule
Emp. Form.C20H21N5O5S2
Mol. Mass.475.541
SMILESNS(=O)(=O)OC[C@H]1C[C@@H](Nc2ccnc3cc(nn23)-c2cccc3sccc23)[C@H](O)[C@@H]1O