Reaction Details
TargetSUMO-activating enzyme subunit 2
LigandBDBM329854
Substrate/Competitorn/a
Meas. Tech.HTRF Assay
IC50<10±n/a nM
Citation Afroze, RBharathan, ITCiavarri, JPFleming, PEGaulin, JLGirard, MLangston, SPSoucy, FWong, TYe, Y Pyrazolopyrimidinyl inhibitors of ubiquitin-activating enzyme US Patent US9796725 Publication Date 10/24/2017
 
SUMO-activating enzyme subunit 2
Name:SUMO-activating enzyme subunit 2
Type:Enzyme
Mol. Mass.:71206.17
Organism:Homo sapiens (Human)
Description:Q9UBT2
Residue:640
BDBM329854
NameBDBM329854
Synonyms:(rac)-[(1R,2R,3S,4R)-4-{[2-(9H-carbazol-2-yl)pyrazolo[1,5-a]pyrimidin-7-yl]amino}- US9663525, Compound I-062 | US9796725, Compound I-062
TypeSmall organic molecule
Emp. Form.C24H24N6O5S
Mol. Mass.508.55
SMILESNS(=O)(=O)OC[C@H]1C[C@@H](Nc2ccnc3cc(nn23)-c2ccc3c(c2)[nH]c2ccccc32)[C@H](O)[C@@H]1O