Reaction Details
TargetSUMO-activating enzyme subunit 2
LigandBDBM329896
Substrate/Competitorn/a
Meas. Tech.HTRF Assay
IC50<10±n/a nM
Citation Afroze, RBharathan, ITCiavarri, JPFleming, PEGaulin, JLGirard, MLangston, SPSoucy, FWong, TYe, Y Pyrazolopyrimidinyl inhibitors of ubiquitin-activating enzyme US Patent US9796725 Publication Date 10/24/2017
 
SUMO-activating enzyme subunit 2
Name:SUMO-activating enzyme subunit 2
Type:Enzyme
Mol. Mass.:71206.17
Organism:Homo sapiens (Human)
Description:Q9UBT2
Residue:640
BDBM329896
NameBDBM329896
Synonyms:(s.e.)-((1R,2R,3S,4R)-2,3-dihydroxy-4-(2-(2-methoxynaphthalen-1-yl)pyrazolo[1,5- US9663525, Compound I-104 | US9796725, Compound I-104
TypeSmall organic molecule
Emp. Form.C23H25N5O6S
Mol. Mass.499.54
SMILESCOc1ccc2ccccc2c1-c1cc2nccc(N[C@@H]3C[C@H](COS(N)(=O)=O)[C@@H](O)[C@H]3O)n2n1