Reaction Details
TargetUbiquitin carboxyl-terminal hydrolase 1/WD repeat-containing protein 48
LigandBDBM350369
Substrate/Competitorn/a
Meas. Tech.Inhibition Assay
IC50 1900±n/a nM
Citation Maloney, DJRosenthal, ASJadhav, ADexheimer, TSSimeonov, AZhuang, ZLiang, QLuci, DK Inhibitors of the USP1/UAF1 deubiquitinase complex and uses thereof US Patent US9802904 Publication Date 10/31/2017
 
Ubiquitin carboxyl-terminal hydrolase 1/WD repeat-containing protein 48
Name:Ubiquitin carboxyl-terminal hydrolase 1/WD repeat-containing protein 48
Type:Protein
Mol. Mass.:n/a
Description:n/a
Components:This complex has 2 components.
Component 1
Name:WD repeat-containing protein 48
Synonyms:KIAA1449 USP1-associated factor 1 WD repeat endosomal protein WDR48 p80
Type:PROTEIN
Mol. Mass.:76215.66
Organism:Homo sapiens (Human)
Description:ChEMBL_109642
Residue:677
Component 2
Name:Ubiquitin carboxyl-terminal hydrolase 1
Synonyms:Deubiquitinating enzyme 1 USP1 Ubiquitin thioesterase 1 hUBP
Type:PROTEIN
Mol. Mass.:88191.62
Organism:Homo sapiens (Human)
Description:ChEMBL_104169
Residue:785
BDBM350369
NameBDBM350369
Synonyms:US9802904, 20 | US9802904, 21
TypeSmall organic molecule
Emp. Form.C27H19F3N4
Mol. Mass.456.4618
SMILESFC(F)(F)c1ccccc1-c1ncc2c(NCc3ccc(cc3)-c3cccnc3)cccc2n1